Custom Query (305 matches)

Filters
 
Or
 
  
 
Columns

Show under each result:


Results (22 - 24 of 305)

1 2 3 4 5 6 7 8 9 10 11 12 13 14 15 16 17 18
Ticket Resolution Summary Owner Reporter
#321 worksforme compilation impossible with --enable-xcache-dprint parameter moo tk1
Description

It is impossible to compile XCache with --enable-xcache-dprint parameter. Compiler prints lots of errors:

Microsoft (R) Program Maintenance Utility Version 9.00.30729.01
Copyright (C) Microsoft Corporation.  All rights reserved.

Recreating build dirs
        type ext\pcre\php_pcre.def > Release_TS\php5ts.dll.def
        "C:\Program Files\Microsoft SDKs\Windows\v6.1\Bin\mc.exe" -h win32\ -r Release_TS\ -x Release_TS\ win32\build\wsyslog.mc
MC: Compiling win32\build\wsyslog.mc
xcache.c
ext\xcache-3.0.3\xcache.c(220) : warning C4013: 'xc_dprint_zval' undefined; assuming extern returning int
xc_stack.c
xc_trace.c
xc_allocator.c
xc_allocator_bestfit.c
xc_compatibility.c
xc_const_string.c
xc_extension.c
xc_ini.c
xc_lock.c
xc_opcode_spec.c
includes.c
Release_TS\ext\xcache-3.0.3\structinfo.m4 is optional if XCache test is not enabled, feel free if it awk failed to produce it
        gawk.exe -f ext\xcache-3.0.3\gen_structinfo.awk < Release_TS\ext\xcache-3.0.3\includes.i > Release_TS\ext\xcache-3.0.3\str
uctinfo.m4.tmp
cygwin warning:
  MS-DOS style path detected: ./ext\xcache-3.0.3\gen_structinfo.awk
  Preferred POSIX equivalent is: ./ext/xcache-3.0.3/gen_structinfo.awk
  CYGWIN environment variable option "nodosfilewarning" turns off this warning.
  Consult the user's guide for more details about POSIX paths:
    http://cygwin.com/cygwin-ug-net/using.html#using-pathnames
        if not errorlevel 1 move Release_TS\ext\xcache-3.0.3\structinfo.m4.tmp Release_TS\ext\xcache-3.0.3\structinfo.m4
        m4.exe -D srcdir=`"ext\xcache-3.0.3'" -D builddir=`"Release_TS\ext\xcache-3.0.3'" -DXCACHE_ENABLE_TEST ext\xcache-3.0.3\pr
ocessor\main.m4 > Release_TS\ext\xcache-3.0.3\processor.out.c.tmp
cygwin warning:
  MS-DOS style path detected: ext\xcache-3.0.3\processor\main.m4
  Preferred POSIX equivalent is: ext/xcache-3.0.3/processor/main.m4
  CYGWIN environment variable option "nodosfilewarning" turns off this warning.
  Consult the user's guide for more details about POSIX paths:
    http://cygwin.com/cygwin-ug-net/using.html#using-pathnames
AUTOCHECK INFO: runtime autocheck Enabled (debug build)
AUTOCHECK INFO: zend_compiled_variable: processor looks good
AUTOCHECK INFO: zend_try_catch_element: processor looks good
AUTOCHECK INFO: zend_brk_cont_element: processor looks good
AUTOCHECK INFO: HashTable: processor looks good
AUTOCHECK INFO: zval: processor looks good
AUTOCHECK INFO: zend_arg_info: processor looks good
AUTOCHECK INFO: zend_constant: processor looks good
AUTOCHECK INFO: zend_property_info: processor looks good
AUTOCHECK INFO: zend_trait_method_reference: processor looks good
AUTOCHECK INFO: zend_trait_alias: processor looks good
AUTOCHECK INFO: zend_trait_precedence: processor looks good
AUTOCHECK INFO: zend_class_entry: processor looks good
AUTOCHECK INFO: znode: processor looks good
AUTOCHECK INFO: zend_op: processor looks good
AUTOCHECK INFO: zend_literal: processor looks good
AUTOCHECK INFO: zend_op_array: processor looks good
AUTOCHECK INFO: xc_constinfo_t: processor looks good
AUTOCHECK INFO: xc_op_array_info_detail_t: processor looks good
AUTOCHECK INFO: xc_op_array_info_t: processor looks good
AUTOCHECK INFO: xc_funcinfo_t: processor looks good
AUTOCHECK INFO: xc_classinfo_t: processor looks good
AUTOCHECK INFO: xc_autoglobal_t: processor looks good
AUTOCHECK INFO: xc_compilererror_t: processor looks good
AUTOCHECK INFO: xc_entry_data_php_t: processor looks good
AUTOCHECK INFO: xc_entry_t: processor looks good
AUTOCHECK INFO: xc_entry_php_t: processor looks good
AUTOCHECK INFO: xc_entry_var_t: processor looks good
        move Release_TS\ext\xcache-3.0.3\processor.out.c.tmp Release_TS\ext\xcache-3.0.3\processor.out.c
        grep.exe "export: " Release_TS\ext\xcache-3.0.3\processor.out.c | sed.exe "s/.*export:\(.*\):export.*/\1/g" > Release_TS\e
xt\xcache-3.0.3\xc_processor.h
cygwin warning:
  MS-DOS style path detected: Release_TS\ext\xcache-3.0.3\processor.out.c
  Preferred POSIX equivalent is: Release_TS/ext/xcache-3.0.3/processor.out.c
  CYGWIN environment variable option "nodosfilewarning" turns off this warning.
  Consult the user's guide for more details about POSIX paths:
    http://cygwin.com/cygwin-ug-net/using.html#using-pathnames
        cat.exe < Release_TS\ext\xcache-3.0.3\xc_processor.h > Release_TS\ext\xcache-3.0.3\xc_processor.h.tmp
        if not errorlevel 1 move Release_TS\ext\xcache-3.0.3\xc_processor.h.tmp Release_TS\ext\xcache-3.0.3\xc_processor.h
        copy Release_TS\ext\xcache-3.0.3\processor.out.c Release_TS\ext\xcache-3.0.3\xc_processor.c.h
Liczba skopiowanych plików:         1.
        cat.exe < Release_TS\ext\xcache-3.0.3\processor.out.c > Release_TS\ext\xcache-3.0.3\xc_processor.c.h.tmp
        if not errorlevel 1 move Release_TS\ext\xcache-3.0.3\xc_processor.c.h.tmp Release_TS\ext\xcache-3.0.3\xc_processor.c.h
xc_processor.c
Release_TS\ext\xcache-3.0.3\xc_processor.c.h(37262) : warning C4018: '<' : signed/unsigned mismatch
Release_TS\ext\xcache-3.0.3\xc_processor.c.h(37264) : warning C4018: '<' : signed/unsigned mismatch
Release_TS\ext\xcache-3.0.3\xc_processor.c.h(37279) : warning C4018: '<' : signed/unsigned mismatch
Release_TS\ext\xcache-3.0.3\xc_processor.c.h(37281) : warning C4018: '<' : signed/unsigned mismatch
Release_TS\ext\xcache-3.0.3\xc_processor.c.h(58483) : warning C4018: '<' : signed/unsigned mismatch
Release_TS\ext\xcache-3.0.3\xc_processor.c.h(58485) : warning C4018: '<' : signed/unsigned mismatch
Release_TS\ext\xcache-3.0.3\xc_processor.c.h(58500) : warning C4018: '<' : signed/unsigned mismatch
Release_TS\ext\xcache-3.0.3\xc_processor.c.h(58502) : warning C4018: '<' : signed/unsigned mismatch
Release_TS\ext\xcache-3.0.3\xc_processor.c.h(66809) : error C2275: 'Bucket' : illegal use of this type as an expression
        Zend\zend_hash.h(64) : see declaration of 'Bucket'
Release_TS\ext\xcache-3.0.3\xc_processor.c.h(66809) : error C2065: 'srcBucket' : undeclared identifier
Release_TS\ext\xcache-3.0.3\xc_processor.c.h(66810) : error C2275: 'Bucket' : illegal use of this type as an expression
        Zend\zend_hash.h(64) : see declaration of 'Bucket'
Release_TS\ext\xcache-3.0.3\xc_processor.c.h(66810) : error C2065: 'pnew' : undeclared identifier
Release_TS\ext\xcache-3.0.3\xc_processor.c.h(66810) : error C2065: 'prev' : undeclared identifier
Release_TS\ext\xcache-3.0.3\xc_processor.c.h(66810) : error C2100: illegal indirection
Release_TS\ext\xcache-3.0.3\xc_processor.c.h(66810) : warning C4047: '=' : 'int' differs in levels of indirection from 'void *'
Release_TS\ext\xcache-3.0.3\xc_processor.c.h(66811) : error C2275: 'zend_bool' : illegal use of this type as an expression
        d:\dev\php-5.4.16\vc9\x86\php-5.4.16\zend\zend_types.h(25) : see declaration of 'zend_bool'
Release_TS\ext\xcache-3.0.3\xc_processor.c.h(66811) : error C2146: syntax error : missing ';' before identifier 'first'
Release_TS\ext\xcache-3.0.3\xc_processor.c.h(66811) : error C2065: 'first' : undeclared identifier
Release_TS\ext\xcache-3.0.3\xc_processor.c.h(67113) : error C2065: 'srcBucket' : undeclared identifier
Release_TS\ext\xcache-3.0.3\xc_processor.c.h(67113) : warning C4047: '=' : 'int' differs in levels of indirection from 'Bucket *co
nst '
Release_TS\ext\xcache-3.0.3\xc_processor.c.h(67113) : error C2065: 'srcBucket' : undeclared identifier
Release_TS\ext\xcache-3.0.3\xc_processor.c.h(67113) : warning C4047: '!=' : 'int' differs in levels of indirection from 'void *'
Release_TS\ext\xcache-3.0.3\xc_processor.c.h(67113) : error C2065: 'srcBucket' : undeclared identifier
Release_TS\ext\xcache-3.0.3\xc_processor.c.h(67113) : error C2065: 'srcBucket' : undeclared identifier
Release_TS\ext\xcache-3.0.3\xc_processor.c.h(67113) : error C2223: left of '->pListNext' must point to struct/union
Release_TS\ext\xcache-3.0.3\xc_processor.c.h(67134) : error C2065: 'srcBucket' : undeclared identifier
Release_TS\ext\xcache-3.0.3\xc_processor.c.h(67134) : error C2223: left of '->arKey' must point to struct/union
Release_TS\ext\xcache-3.0.3\xc_processor.c.h(67134) : error C2065: 'srcBucket' : undeclared identifier
Release_TS\ext\xcache-3.0.3\xc_processor.c.h(67134) : error C2223: left of '->nKeyLength' must point to struct/union
Release_TS\ext\xcache-3.0.3\xc_processor.c.h(67134) : error C2198: 'xc_dprint_str_len' : too few arguments for call
Release_TS\ext\xcache-3.0.3\xc_processor.c.h(67135) : error C2065: 'srcBucket' : undeclared identifier
Release_TS\ext\xcache-3.0.3\xc_processor.c.h(67135) : error C2223: left of '->nKeyLength' must point to struct/union
Release_TS\ext\xcache-3.0.3\xc_processor.c.h(67135) : error C2065: 'srcBucket' : undeclared identifier
Release_TS\ext\xcache-3.0.3\xc_processor.c.h(67135) : error C2223: left of '->h' must point to struct/union
Release_TS\ext\xcache-3.0.3\xc_processor.c.h(67147) : error C2065: 'srcBucket' : undeclared identifier
Release_TS\ext\xcache-3.0.3\xc_processor.c.h(67147) : error C2223: left of '->pData' must point to struct/union
Release_TS\ext\xcache-3.0.3\xc_processor.c.h(67151) : error C2065: 'srcBucket' : undeclared identifier
Release_TS\ext\xcache-3.0.3\xc_processor.c.h(67151) : error C2223: left of '->pData' must point to struct/union
Release_TS\ext\xcache-3.0.3\xc_processor.c.h(67157) : warning C4047: 'function' : 'const zval_ptr *const ' differs in levels of in
direction from 'int'
Release_TS\ext\xcache-3.0.3\xc_processor.c.h(67157) : warning C4024: 'xc_dprint_zval_ptr' : different types for formal and actual
parameter 1
Release_TS\ext\xcache-3.0.3\xc_processor.c.h(67158) : warning C4047: 'function' : 'int' differs in levels of indirection from 'voi
d ***'
Release_TS\ext\xcache-3.0.3\xc_processor.c.h(67158) : warning C4024: 'xc_dprint_zval_ptr' : different types for formal and actual
parameter 2
Release_TS\ext\xcache-3.0.3\xc_processor.c.h(67158) : error C2198: 'xc_dprint_zval_ptr' : too few arguments for call
Release_TS\ext\xcache-3.0.3\xc_processor.c.h(67173) : error C2065: 'srcBucket' : undeclared identifier
Release_TS\ext\xcache-3.0.3\xc_processor.c.h(67173) : error C2223: left of '->pData' must point to struct/union
Release_TS\ext\xcache-3.0.3\xc_processor.c.h(67188) : error C2065: 'srcBucket' : undeclared identifier
Release_TS\ext\xcache-3.0.3\xc_processor.c.h(67188) : error C2223: left of '->pData' must point to struct/union
Release_TS\ext\xcache-3.0.3\xc_processor.c.h(67194) : warning C4047: 'function' : 'const zval_ptr *const ' differs in levels of in
direction from 'int'
Release_TS\ext\xcache-3.0.3\xc_processor.c.h(67194) : warning C4024: 'xc_dprint_zval_ptr' : different types for formal and actual
parameter 1
Release_TS\ext\xcache-3.0.3\xc_processor.c.h(67195) : warning C4047: 'function' : 'int' differs in levels of indirection from 'voi
d ***'
Release_TS\ext\xcache-3.0.3\xc_processor.c.h(67195) : warning C4024: 'xc_dprint_zval_ptr' : different types for formal and actual
parameter 2
Release_TS\ext\xcache-3.0.3\xc_processor.c.h(67195) : error C2198: 'xc_dprint_zval_ptr' : too few arguments for call
Release_TS\ext\xcache-3.0.3\xc_processor.c.h(67203) : error C2065: 'first' : undeclared identifier
Release_TS\ext\xcache-3.0.3\xc_processor.c.h(67205) : error C2065: 'first' : undeclared identifier
Release_TS\ext\xcache-3.0.3\xc_processor.c.h(67209) : error C2065: 'prev' : undeclared identifier
Release_TS\ext\xcache-3.0.3\xc_processor.c.h(67209) : error C2065: 'pnew' : undeclared identifier
Release_TS\ext\xcache-3.0.3\xc_processor.c.h(67605) : error C2275: 'Bucket' : illegal use of this type as an expression
        Zend\zend_hash.h(64) : see declaration of 'Bucket'
Release_TS\ext\xcache-3.0.3\xc_processor.c.h(67605) : error C2065: 'srcBucket' : undeclared identifier
Release_TS\ext\xcache-3.0.3\xc_processor.c.h(67606) : error C2275: 'Bucket' : illegal use of this type as an expression
        Zend\zend_hash.h(64) : see declaration of 'Bucket'
Release_TS\ext\xcache-3.0.3\xc_processor.c.h(67606) : error C2065: 'pnew' : undeclared identifier
Release_TS\ext\xcache-3.0.3\xc_processor.c.h(67606) : error C2065: 'prev' : undeclared identifier
Release_TS\ext\xcache-3.0.3\xc_processor.c.h(67606) : error C2100: illegal indirection
Release_TS\ext\xcache-3.0.3\xc_processor.c.h(67606) : warning C4047: '=' : 'int' differs in levels of indirection from 'void *'
Release_TS\ext\xcache-3.0.3\xc_processor.c.h(67607) : error C2275: 'zend_bool' : illegal use of this type as an expression
        d:\dev\php-5.4.16\vc9\x86\php-5.4.16\zend\zend_types.h(25) : see declaration of 'zend_bool'
Release_TS\ext\xcache-3.0.3\xc_processor.c.h(67607) : error C2146: syntax error : missing ';' before identifier 'first'
Release_TS\ext\xcache-3.0.3\xc_processor.c.h(67607) : error C2065: 'first' : undeclared identifier
Release_TS\ext\xcache-3.0.3\xc_processor.c.h(67909) : error C2065: 'srcBucket' : undeclared identifier
Release_TS\ext\xcache-3.0.3\xc_processor.c.h(67909) : warning C4047: '=' : 'int' differs in levels of indirection from 'Bucket *co
nst '
Release_TS\ext\xcache-3.0.3\xc_processor.c.h(67909) : error C2065: 'srcBucket' : undeclared identifier
Release_TS\ext\xcache-3.0.3\xc_processor.c.h(67909) : warning C4047: '!=' : 'int' differs in levels of indirection from 'void *'
Release_TS\ext\xcache-3.0.3\xc_processor.c.h(67909) : error C2065: 'srcBucket' : undeclared identifier
Release_TS\ext\xcache-3.0.3\xc_processor.c.h(67909) : error C2065: 'srcBucket' : undeclared identifier
Release_TS\ext\xcache-3.0.3\xc_processor.c.h(67909) : error C2223: left of '->pListNext' must point to struct/union
Release_TS\ext\xcache-3.0.3\xc_processor.c.h(67930) : error C2065: 'srcBucket' : undeclared identifier
Release_TS\ext\xcache-3.0.3\xc_processor.c.h(67930) : error C2223: left of '->arKey' must point to struct/union
Release_TS\ext\xcache-3.0.3\xc_processor.c.h(67930) : error C2065: 'srcBucket' : undeclared identifier
Release_TS\ext\xcache-3.0.3\xc_processor.c.h(67930) : error C2223: left of '->nKeyLength' must point to struct/union
Release_TS\ext\xcache-3.0.3\xc_processor.c.h(67930) : error C2198: 'xc_dprint_str_len' : too few arguments for call
Release_TS\ext\xcache-3.0.3\xc_processor.c.h(67931) : error C2065: 'srcBucket' : undeclared identifier
Release_TS\ext\xcache-3.0.3\xc_processor.c.h(67931) : error C2223: left of '->nKeyLength' must point to struct/union
Release_TS\ext\xcache-3.0.3\xc_processor.c.h(67931) : error C2065: 'srcBucket' : undeclared identifier
Release_TS\ext\xcache-3.0.3\xc_processor.c.h(67931) : error C2223: left of '->h' must point to struct/union
Release_TS\ext\xcache-3.0.3\xc_processor.c.h(67943) : error C2065: 'srcBucket' : undeclared identifier
Release_TS\ext\xcache-3.0.3\xc_processor.c.h(67943) : error C2223: left of '->pData' must point to struct/union
Release_TS\ext\xcache-3.0.3\xc_processor.c.h(67947) : error C2065: 'srcBucket' : undeclared identifier
Release_TS\ext\xcache-3.0.3\xc_processor.c.h(67947) : error C2223: left of '->pData' must point to struct/union
Release_TS\ext\xcache-3.0.3\xc_processor.c.h(67953) : warning C4047: 'function' : 'const zend_function *const ' differs in levels
of indirection from 'int'
Release_TS\ext\xcache-3.0.3\xc_processor.c.h(67953) : warning C4024: 'xc_dprint_zend_function' : different types for formal and ac
tual parameter 1
Release_TS\ext\xcache-3.0.3\xc_processor.c.h(67954) : warning C4047: 'function' : 'int' differs in levels of indirection from 'voi
d ***'
Release_TS\ext\xcache-3.0.3\xc_processor.c.h(67954) : warning C4024: 'xc_dprint_zend_function' : different types for formal and ac
tual parameter 2
Release_TS\ext\xcache-3.0.3\xc_processor.c.h(67954) : error C2198: 'xc_dprint_zend_function' : too few arguments for call
Release_TS\ext\xcache-3.0.3\xc_processor.c.h(67969) : error C2065: 'srcBucket' : undeclared identifier
Release_TS\ext\xcache-3.0.3\xc_processor.c.h(67969) : error C2223: left of '->pData' must point to struct/union
Release_TS\ext\xcache-3.0.3\xc_processor.c.h(67984) : error C2065: 'srcBucket' : undeclared identifier
Release_TS\ext\xcache-3.0.3\xc_processor.c.h(67984) : error C2223: left of '->pData' must point to struct/union
Release_TS\ext\xcache-3.0.3\xc_processor.c.h(67990) : warning C4047: 'function' : 'const zend_function *const ' differs in levels
of indirection from 'int'
Release_TS\ext\xcache-3.0.3\xc_processor.c.h(67990) : warning C4024: 'xc_dprint_zend_function' : different types for formal and ac
tual parameter 1
Release_TS\ext\xcache-3.0.3\xc_processor.c.h(67991) : warning C4047: 'function' : 'int' differs in levels of indirection from 'voi
d ***'
Release_TS\ext\xcache-3.0.3\xc_processor.c.h(67991) : warning C4024: 'xc_dprint_zend_function' : different types for formal and ac
tual parameter 2
Release_TS\ext\xcache-3.0.3\xc_processor.c.h(67991) : error C2198: 'xc_dprint_zend_function' : too few arguments for call
Release_TS\ext\xcache-3.0.3\xc_processor.c.h(67999) : error C2065: 'first' : undeclared identifier
Release_TS\ext\xcache-3.0.3\xc_processor.c.h(68001) : error C2065: 'first' : undeclared identifier
Release_TS\ext\xcache-3.0.3\xc_processor.c.h(68005) : error C2065: 'prev' : undeclared identifier
Release_TS\ext\xcache-3.0.3\xc_processor.c.h(68005) : error C2065: 'pnew' : undeclared identifier
Release_TS\ext\xcache-3.0.3\xc_processor.c.h(68400) : error C2275: 'Bucket' : illegal use of this type as an expression
        Zend\zend_hash.h(64) : see declaration of 'Bucket'
Release_TS\ext\xcache-3.0.3\xc_processor.c.h(68400) : error C2065: 'srcBucket' : undeclared identifier
Release_TS\ext\xcache-3.0.3\xc_processor.c.h(68401) : error C2275: 'Bucket' : illegal use of this type as an expression
        Zend\zend_hash.h(64) : see declaration of 'Bucket'
Release_TS\ext\xcache-3.0.3\xc_processor.c.h(68401) : error C2065: 'pnew' : undeclared identifier
Release_TS\ext\xcache-3.0.3\xc_processor.c.h(68401) : error C2065: 'prev' : undeclared identifier
Release_TS\ext\xcache-3.0.3\xc_processor.c.h(68401) : error C2100: illegal indirection
Release_TS\ext\xcache-3.0.3\xc_processor.c.h(68401) : warning C4047: '=' : 'int' differs in levels of indirection from 'void *'
Release_TS\ext\xcache-3.0.3\xc_processor.c.h(68402) : error C2275: 'zend_bool' : illegal use of this type as an expression
        d:\dev\php-5.4.16\vc9\x86\php-5.4.16\zend\zend_types.h(25) : see declaration of 'zend_bool'
Release_TS\ext\xcache-3.0.3\xc_processor.c.h(68402) : error C2146: syntax error : missing ';' before identifier 'first'
Release_TS\ext\xcache-3.0.3\xc_processor.c.h(68402) : error C2065: 'first' : undeclared identifier
Release_TS\ext\xcache-3.0.3\xc_processor.c.h(68704) : error C2065: 'srcBucket' : undeclared identifier
Release_TS\ext\xcache-3.0.3\xc_processor.c.h(68704) : warning C4047: '=' : 'int' differs in levels of indirection from 'Bucket *co
nst '
Release_TS\ext\xcache-3.0.3\xc_processor.c.h(68704) : error C2065: 'srcBucket' : undeclared identifier
Release_TS\ext\xcache-3.0.3\xc_processor.c.h(68704) : warning C4047: '!=' : 'int' differs in levels of indirection from 'void *'
Release_TS\ext\xcache-3.0.3\xc_processor.c.h(68704) : error C2065: 'srcBucket' : undeclared identifier
Release_TS\ext\xcache-3.0.3\xc_processor.c.h(68704) : error C2065: 'srcBucket' : undeclared identifier
Release_TS\ext\xcache-3.0.3\xc_processor.c.h(68704) : error C2223: left of '->pListNext' must point to struct/union
Release_TS\ext\xcache-3.0.3\xc_processor.c.h(68725) : error C2065: 'srcBucket' : undeclared identifier
Release_TS\ext\xcache-3.0.3\xc_processor.c.h(68725) : error C2223: left of '->arKey' must point to struct/union
Release_TS\ext\xcache-3.0.3\xc_processor.c.h(68725) : error C2065: 'srcBucket' : undeclared identifier
Release_TS\ext\xcache-3.0.3\xc_processor.c.h(68725) : error C2223: left of '->nKeyLength' must point to struct/union
Release_TS\ext\xcache-3.0.3\xc_processor.c.h(68725) : error C2198: 'xc_dprint_str_len' : too few arguments for call
Release_TS\ext\xcache-3.0.3\xc_processor.c.h(68726) : error C2065: 'srcBucket' : undeclared identifier
Release_TS\ext\xcache-3.0.3\xc_processor.c.h(68726) : error C2223: left of '->nKeyLength' must point to struct/union
Release_TS\ext\xcache-3.0.3\xc_processor.c.h(68726) : error C2065: 'srcBucket' : undeclared identifier
Release_TS\ext\xcache-3.0.3\xc_processor.c.h(68726) : error C2223: left of '->h' must point to struct/union
Release_TS\ext\xcache-3.0.3\xc_processor.c.h(68738) : error C2065: 'srcBucket' : undeclared identifier
Release_TS\ext\xcache-3.0.3\xc_processor.c.h(68738) : error C2223: left of '->pData' must point to struct/union
Release_TS\ext\xcache-3.0.3\xc_processor.c.h(68742) : error C2065: 'srcBucket' : undeclared identifier
Release_TS\ext\xcache-3.0.3\xc_processor.c.h(68742) : error C2223: left of '->pData' must point to struct/union
Release_TS\ext\xcache-3.0.3\xc_processor.c.h(68742) : fatal error C1003: error count exceeds 100; stopping compilation
NMAKE : fatal error U1077: '"C:\Program Files\Microsoft Visual Studio 9.0\VC\Bin\cl.exe"' : return code '0x2'
Stop.
#320 fixed MS VC compiler warnings moo tk1
Description

While compiling under MS VC 2008 I see such warnings:

ext\xcache-3.0.3\xcache.c(117) : warning C4068: unknown pragma
ext\xcache-3.0.3\xcache.c(118) : warning C4068: unknown pragma
ext\xcache-3.0.3\xcache.c(126) : warning C4068: unknown pragma

It's bacause VC doesn't know.

#pragma GCC pop_options

I managed to avoid those warnings by wrapping this directive with "#ifndef _MSC_VER" and "#endif". But it would be nicer to add some directive known only to GCC.

#319 invalid XCache 3.0.3 fails to build on Fedora 19 moo jtdarlington
Description

I just upgraded one of my systems from Fedora 17 to Fedora 19. XCache 3.0.3 built fine under Fedora 17 and worked great. However, I am unable to build under Fedora 19. phpize and configure seem to produce no errors, but make crashes building processor.out.c. I've attached the output of all three commands below.

[jeff@hera xcache-3.0.3]$ phpize Configuring for: PHP Api Version: 20121113 Zend Module Api No: 20121212 Zend Extension Api No: 220121212

[jeff@hera xcache-3.0.3]$ ./configure --enable-xcache checking for grep that handles long lines and -e... /usr/bin/grep checking for egrep... /usr/bin/grep -E checking for a sed that does not truncate output... /usr/bin/sed checking for cc... cc checking whether the C compiler works... yes checking for C compiler default output file name... a.out checking for suffix of executables... checking whether we are cross compiling... no checking for suffix of object files... o checking whether we are using the GNU C compiler... yes checking whether cc accepts -g... yes checking for cc option to accept ISO C89... none needed checking how to run the C preprocessor... cc -E checking for icc... no checking for suncc... no checking whether cc understands -c and -o together... yes checking for system library directory... lib checking if compiler supports -R... no checking if compiler supports -Wl,-rpath,... yes checking build system type... x86_64-unknown-linux-gnu checking host system type... x86_64-unknown-linux-gnu checking target system type... x86_64-unknown-linux-gnu checking for PHP prefix... /usr checking for PHP includes... -I/usr/include/php -I/usr/include/php/main -I/usr/include/php/TSRM -I/usr/include/php/Zend -I/usr/include/php/ext -I/usr/include/php/ext/date/lib checking for PHP extension directory... /usr/lib64/php/modules checking for PHP installed headers prefix... /usr/include/php checking if debug is enabled... no checking if zts is enabled... no checking for re2c... no configure: WARNING: You will need re2c 0.13.4 or later if you want to regenerate PHP parsers. checking for gawk... gawk checking for XCache support... yes, shared checking for XCache handle of compile time constant... yes checking for XCache optimizer... no checking for XCache coverager... no checking for XCache assembler... no checking for XCache disassembler... no checking for XCache encoder... no checking for XCache decoder... no checking for XCache self test... no checking for XCache self test... no checking for gawk... /usr/bin/gawk checking for m4... /usr/bin/m4 checking for grep... (cached) /usr/bin/grep checking for sed... (cached) /usr/bin/sed checking for indent... /usr/bin/indent checking how to print strings... printf checking for a sed that does not truncate output... (cached) /usr/bin/sed checking for fgrep... /usr/bin/grep -F checking for ld used by cc... /usr/bin/ld checking if the linker (/usr/bin/ld) is GNU ld... yes checking for BSD- or MS-compatible name lister (nm)... /usr/bin/nm -B checking the name lister (/usr/bin/nm -B) interface... BSD nm checking whether ln -s works... yes checking the maximum length of command line arguments... 1572864 checking whether the shell understands some XSI constructs... yes checking whether the shell understands "+="... yes checking how to convert x86_64-unknown-linux-gnu file names to x86_64-unknown-linux-gnu format... func_convert_file_noop checking how to convert x86_64-unknown-linux-gnu file names to toolchain format... func_convert_file_noop checking for /usr/bin/ld option to reload object files... -r checking for objdump... objdump checking how to recognize dependent libraries... pass_all checking for dlltool... no checking how to associate runtime and link libraries... printf %s\n checking for ar... ar checking for archiver @FILE support... @ checking for strip... strip checking for ranlib... ranlib checking for gawk... (cached) gawk checking command to parse /usr/bin/nm -B output from cc object... ok checking for sysroot... no checking for mt... no checking if : is a manifest tool... no checking for ANSI C header files... yes checking for sys/types.h... yes checking for sys/stat.h... yes checking for stdlib.h... yes checking for string.h... yes checking for memory.h... yes checking for strings.h... yes checking for inttypes.h... yes checking for stdint.h... yes checking for unistd.h... yes checking for dlfcn.h... yes checking for objdir... .libs checking if cc supports -fno-rtti -fno-exceptions... no checking for cc option to produce PIC... -fPIC -DPIC checking if cc PIC flag -fPIC -DPIC works... yes checking if cc static flag -static works... no checking if cc supports -c -o file.o... yes checking if cc supports -c -o file.o... (cached) yes checking whether the cc linker (/usr/bin/ld -m elf_x86_64) supports shared libraries... yes checking whether -lc should be explicitly linked in... no checking dynamic linker characteristics... GNU/Linux ld.so checking how to hardcode library paths into programs... immediate checking whether stripping libraries is possible... yes checking if libtool supports shared libraries... yes checking whether to build shared libraries... yes checking whether to build static libraries... no configure: creating ./config.status config.status: creating config.h config.status: config.h is unchanged config.status: executing libtool commands

[jeff@hera xcache-3.0.3]$ ./configure --enable-xcache checking for grep that handles long lines and -e... /usr/bin/grep checking for egrep... /usr/bin/grep -E checking for a sed that does not truncate output... /usr/bin/sed checking for cc... cc checking whether the C compiler works... yes checking for C compiler default output file name... a.out checking for suffix of executables... checking whether we are cross compiling... no checking for suffix of object files... o checking whether we are using the GNU C compiler... yes checking whether cc accepts -g... yes checking for cc option to accept ISO C89... none needed checking how to run the C preprocessor... cc -E checking for icc... no checking for suncc... no checking whether cc understands -c and -o together... yes checking for system library directory... lib checking if compiler supports -R... no checking if compiler supports -Wl,-rpath,... yes checking build system type... x86_64-unknown-linux-gnu checking host system type... x86_64-unknown-linux-gnu checking target system type... x86_64-unknown-linux-gnu checking for PHP prefix... /usr checking for PHP includes... -I/usr/include/php -I/usr/include/php/main -I/usr/include/php/TSRM -I/usr/include/php/Zend -I/usr/include/php/ext -I/usr/include/php/ext/date/lib checking for PHP extension directory... /usr/lib64/php/modules checking for PHP installed headers prefix... /usr/include/php checking if debug is enabled... no checking if zts is enabled... no checking for re2c... no configure: WARNING: You will need re2c 0.13.4 or later if you want to regenerate PHP parsers. checking for gawk... gawk checking for XCache support... yes, shared checking for XCache handle of compile time constant... yes checking for XCache optimizer... no checking for XCache coverager... no checking for XCache assembler... no checking for XCache disassembler... no checking for XCache encoder... no checking for XCache decoder... no checking for XCache self test... no checking for XCache self test... no checking for gawk... /usr/bin/gawk checking for m4... /usr/bin/m4 checking for grep... (cached) /usr/bin/grep checking for sed... (cached) /usr/bin/sed checking for indent... /usr/bin/indent checking how to print strings... printf checking for a sed that does not truncate output... (cached) /usr/bin/sed checking for fgrep... /usr/bin/grep -F checking for ld used by cc... /usr/bin/ld checking if the linker (/usr/bin/ld) is GNU ld... yes checking for BSD- or MS-compatible name lister (nm)... /usr/bin/nm -B checking the name lister (/usr/bin/nm -B) interface... BSD nm checking whether ln -s works... yes checking the maximum length of command line arguments... 1572864 checking whether the shell understands some XSI constructs... yes checking whether the shell understands "+="... yes checking how to convert x86_64-unknown-linux-gnu file names to x86_64-unknown-linux-gnu format... func_convert_file_noop checking how to convert x86_64-unknown-linux-gnu file names to toolchain format... func_convert_file_noop checking for /usr/bin/ld option to reload object files... -r checking for objdump... objdump checking how to recognize dependent libraries... pass_all checking for dlltool... no checking how to associate runtime and link libraries... printf %s\n checking for ar... ar checking for archiver @FILE support... @ checking for strip... strip checking for ranlib... ranlib checking for gawk... (cached) gawk checking command to parse /usr/bin/nm -B output from cc object... ok checking for sysroot... no checking for mt... no checking if : is a manifest tool... no checking for ANSI C header files... yes checking for sys/types.h... yes checking for sys/stat.h... yes checking for stdlib.h... yes checking for string.h... yes checking for memory.h... yes checking for strings.h... yes checking for inttypes.h... yes checking for stdint.h... yes checking for unistd.h... yes checking for dlfcn.h... yes checking for objdir... .libs checking if cc supports -fno-rtti -fno-exceptions... no checking for cc option to produce PIC... -fPIC -DPIC checking if cc PIC flag -fPIC -DPIC works... yes checking if cc static flag -static works... no checking if cc supports -c -o file.o... yes checking if cc supports -c -o file.o... (cached) yes checking whether the cc linker (/usr/bin/ld -m elf_x86_64) supports shared libraries... yes checking whether -lc should be explicitly linked in... no checking dynamic linker characteristics... GNU/Linux ld.so checking how to hardcode library paths into programs... immediate checking whether stripping libraries is possible... yes checking if libtool supports shared libraries... yes checking whether to build shared libraries... yes checking whether to build static libraries... no configure: creating ./config.status config.status: creating config.h config.status: config.h is unchanged config.status: executing libtool commands

[jeff@hera xcache-3.0.3]$ make /bin/sh /home/jeff/software/builds/xcache-3.0.3/libtool --mode=compile cc -I. -I/home/jeff/software/builds/xcache-3.0.3 -DPHP_ATOM_INC -I/home/jeff/software/builds/xcache-3.0.3/include -I/home/jeff/software/builds/xcache-3.0.3/main -I/home/jeff/software/builds/xcache-3.0.3 -I/usr/include/php -I/usr/include/php/main -I/usr/include/php/TSRM -I/usr/include/php/Zend -I/usr/include/php/ext -I/usr/include/php/ext/date/lib -DHAVE_CONFIG_H -g -O2 -c /home/jeff/software/builds/xcache-3.0.3/xcache.c -o xcache.lo libtool: compile: cc -I. -I/home/jeff/software/builds/xcache-3.0.3 -DPHP_ATOM_INC -I/home/jeff/software/builds/xcache-3.0.3/include -I/home/jeff/software/builds/xcache-3.0.3/main -I/home/jeff/software/builds/xcache-3.0.3 -I/usr/include/php -I/usr/include/php/main -I/usr/include/php/TSRM -I/usr/include/php/Zend -I/usr/include/php/ext -I/usr/include/php/ext/date/lib -DHAVE_CONFIG_H -g -O2 -c /home/jeff/software/builds/xcache-3.0.3/xcache.c -fPIC -DPIC -o .libs/xcache.o /bin/sh /home/jeff/software/builds/xcache-3.0.3/libtool --mode=compile cc -I. -I/home/jeff/software/builds/xcache-3.0.3 -DPHP_ATOM_INC -I/home/jeff/software/builds/xcache-3.0.3/include -I/home/jeff/software/builds/xcache-3.0.3/main -I/home/jeff/software/builds/xcache-3.0.3 -I/usr/include/php -I/usr/include/php/main -I/usr/include/php/TSRM -I/usr/include/php/Zend -I/usr/include/php/ext -I/usr/include/php/ext/date/lib -DHAVE_CONFIG_H -g -O2 -c /home/jeff/software/builds/xcache-3.0.3/util/xc_stack.c -o util/xc_stack.lo libtool: compile: cc -I. -I/home/jeff/software/builds/xcache-3.0.3 -DPHP_ATOM_INC -I/home/jeff/software/builds/xcache-3.0.3/include -I/home/jeff/software/builds/xcache-3.0.3/main -I/home/jeff/software/builds/xcache-3.0.3 -I/usr/include/php -I/usr/include/php/main -I/usr/include/php/TSRM -I/usr/include/php/Zend -I/usr/include/php/ext -I/usr/include/php/ext/date/lib -DHAVE_CONFIG_H -g -O2 -c /home/jeff/software/builds/xcache-3.0.3/util/xc_stack.c -fPIC -DPIC -o util/.libs/xc_stack.o /bin/sh /home/jeff/software/builds/xcache-3.0.3/libtool --mode=compile cc -I. -I/home/jeff/software/builds/xcache-3.0.3 -DPHP_ATOM_INC -I/home/jeff/software/builds/xcache-3.0.3/include -I/home/jeff/software/builds/xcache-3.0.3/main -I/home/jeff/software/builds/xcache-3.0.3 -I/usr/include/php -I/usr/include/php/main -I/usr/include/php/TSRM -I/usr/include/php/Zend -I/usr/include/php/ext -I/usr/include/php/ext/date/lib -DHAVE_CONFIG_H -g -O2 -c /home/jeff/software/builds/xcache-3.0.3/util/xc_trace.c -o util/xc_trace.lo libtool: compile: cc -I. -I/home/jeff/software/builds/xcache-3.0.3 -DPHP_ATOM_INC -I/home/jeff/software/builds/xcache-3.0.3/include -I/home/jeff/software/builds/xcache-3.0.3/main -I/home/jeff/software/builds/xcache-3.0.3 -I/usr/include/php -I/usr/include/php/main -I/usr/include/php/TSRM -I/usr/include/php/Zend -I/usr/include/php/ext -I/usr/include/php/ext/date/lib -DHAVE_CONFIG_H -g -O2 -c /home/jeff/software/builds/xcache-3.0.3/util/xc_trace.c -fPIC -DPIC -o util/.libs/xc_trace.o /bin/sh /home/jeff/software/builds/xcache-3.0.3/libtool --mode=compile cc -I. -I/home/jeff/software/builds/xcache-3.0.3 -DPHP_ATOM_INC -I/home/jeff/software/builds/xcache-3.0.3/include -I/home/jeff/software/builds/xcache-3.0.3/main -I/home/jeff/software/builds/xcache-3.0.3 -I/usr/include/php -I/usr/include/php/main -I/usr/include/php/TSRM -I/usr/include/php/Zend -I/usr/include/php/ext -I/usr/include/php/ext/date/lib -DHAVE_CONFIG_H -g -O2 -c /home/jeff/software/builds/xcache-3.0.3/xcache/xc_allocator.c -o xcache/xc_allocator.lo libtool: compile: cc -I. -I/home/jeff/software/builds/xcache-3.0.3 -DPHP_ATOM_INC -I/home/jeff/software/builds/xcache-3.0.3/include -I/home/jeff/software/builds/xcache-3.0.3/main -I/home/jeff/software/builds/xcache-3.0.3 -I/usr/include/php -I/usr/include/php/main -I/usr/include/php/TSRM -I/usr/include/php/Zend -I/usr/include/php/ext -I/usr/include/php/ext/date/lib -DHAVE_CONFIG_H -g -O2 -c /home/jeff/software/builds/xcache-3.0.3/xcache/xc_allocator.c -fPIC -DPIC -o xcache/.libs/xc_allocator.o /bin/sh /home/jeff/software/builds/xcache-3.0.3/libtool --mode=compile cc -I. -I/home/jeff/software/builds/xcache-3.0.3 -DPHP_ATOM_INC -I/home/jeff/software/builds/xcache-3.0.3/include -I/home/jeff/software/builds/xcache-3.0.3/main -I/home/jeff/software/builds/xcache-3.0.3 -I/usr/include/php -I/usr/include/php/main -I/usr/include/php/TSRM -I/usr/include/php/Zend -I/usr/include/php/ext -I/usr/include/php/ext/date/lib -DHAVE_CONFIG_H -g -O2 -c /home/jeff/software/builds/xcache-3.0.3/xcache/xc_allocator_bestfit.c -o xcache/xc_allocator_bestfit.lo libtool: compile: cc -I. -I/home/jeff/software/builds/xcache-3.0.3 -DPHP_ATOM_INC -I/home/jeff/software/builds/xcache-3.0.3/include -I/home/jeff/software/builds/xcache-3.0.3/main -I/home/jeff/software/builds/xcache-3.0.3 -I/usr/include/php -I/usr/include/php/main -I/usr/include/php/TSRM -I/usr/include/php/Zend -I/usr/include/php/ext -I/usr/include/php/ext/date/lib -DHAVE_CONFIG_H -g -O2 -c /home/jeff/software/builds/xcache-3.0.3/xcache/xc_allocator_bestfit.c -fPIC -DPIC -o xcache/.libs/xc_allocator_bestfit.o /bin/sh /home/jeff/software/builds/xcache-3.0.3/libtool --mode=compile cc -I. -I/home/jeff/software/builds/xcache-3.0.3 -DPHP_ATOM_INC -I/home/jeff/software/builds/xcache-3.0.3/include -I/home/jeff/software/builds/xcache-3.0.3/main -I/home/jeff/software/builds/xcache-3.0.3 -I/usr/include/php -I/usr/include/php/main -I/usr/include/php/TSRM -I/usr/include/php/Zend -I/usr/include/php/ext -I/usr/include/php/ext/date/lib -DHAVE_CONFIG_H -g -O2 -c /home/jeff/software/builds/xcache-3.0.3/xcache/xc_compatibility.c -o xcache/xc_compatibility.lo libtool: compile: cc -I. -I/home/jeff/software/builds/xcache-3.0.3 -DPHP_ATOM_INC -I/home/jeff/software/builds/xcache-3.0.3/include -I/home/jeff/software/builds/xcache-3.0.3/main -I/home/jeff/software/builds/xcache-3.0.3 -I/usr/include/php -I/usr/include/php/main -I/usr/include/php/TSRM -I/usr/include/php/Zend -I/usr/include/php/ext -I/usr/include/php/ext/date/lib -DHAVE_CONFIG_H -g -O2 -c /home/jeff/software/builds/xcache-3.0.3/xcache/xc_compatibility.c -fPIC -DPIC -o xcache/.libs/xc_compatibility.o /bin/sh /home/jeff/software/builds/xcache-3.0.3/libtool --mode=compile cc -I. -I/home/jeff/software/builds/xcache-3.0.3 -DPHP_ATOM_INC -I/home/jeff/software/builds/xcache-3.0.3/include -I/home/jeff/software/builds/xcache-3.0.3/main -I/home/jeff/software/builds/xcache-3.0.3 -I/usr/include/php -I/usr/include/php/main -I/usr/include/php/TSRM -I/usr/include/php/Zend -I/usr/include/php/ext -I/usr/include/php/ext/date/lib -DHAVE_CONFIG_H -g -O2 -c /home/jeff/software/builds/xcache-3.0.3/xcache/xc_const_string.c -o xcache/xc_const_string.lo libtool: compile: cc -I. -I/home/jeff/software/builds/xcache-3.0.3 -DPHP_ATOM_INC -I/home/jeff/software/builds/xcache-3.0.3/include -I/home/jeff/software/builds/xcache-3.0.3/main -I/home/jeff/software/builds/xcache-3.0.3 -I/usr/include/php -I/usr/include/php/main -I/usr/include/php/TSRM -I/usr/include/php/Zend -I/usr/include/php/ext -I/usr/include/php/ext/date/lib -DHAVE_CONFIG_H -g -O2 -c /home/jeff/software/builds/xcache-3.0.3/xcache/xc_const_string.c -fPIC -DPIC -o xcache/.libs/xc_const_string.o /bin/sh /home/jeff/software/builds/xcache-3.0.3/libtool --mode=compile cc -I. -I/home/jeff/software/builds/xcache-3.0.3 -DPHP_ATOM_INC -I/home/jeff/software/builds/xcache-3.0.3/include -I/home/jeff/software/builds/xcache-3.0.3/main -I/home/jeff/software/builds/xcache-3.0.3 -I/usr/include/php -I/usr/include/php/main -I/usr/include/php/TSRM -I/usr/include/php/Zend -I/usr/include/php/ext -I/usr/include/php/ext/date/lib -DHAVE_CONFIG_H -g -O2 -c /home/jeff/software/builds/xcache-3.0.3/xcache/xc_extension.c -o xcache/xc_extension.lo libtool: compile: cc -I. -I/home/jeff/software/builds/xcache-3.0.3 -DPHP_ATOM_INC -I/home/jeff/software/builds/xcache-3.0.3/include -I/home/jeff/software/builds/xcache-3.0.3/main -I/home/jeff/software/builds/xcache-3.0.3 -I/usr/include/php -I/usr/include/php/main -I/usr/include/php/TSRM -I/usr/include/php/Zend -I/usr/include/php/ext -I/usr/include/php/ext/date/lib -DHAVE_CONFIG_H -g -O2 -c /home/jeff/software/builds/xcache-3.0.3/xcache/xc_extension.c -fPIC -DPIC -o xcache/.libs/xc_extension.o /bin/sh /home/jeff/software/builds/xcache-3.0.3/libtool --mode=compile cc -I. -I/home/jeff/software/builds/xcache-3.0.3 -DPHP_ATOM_INC -I/home/jeff/software/builds/xcache-3.0.3/include -I/home/jeff/software/builds/xcache-3.0.3/main -I/home/jeff/software/builds/xcache-3.0.3 -I/usr/include/php -I/usr/include/php/main -I/usr/include/php/TSRM -I/usr/include/php/Zend -I/usr/include/php/ext -I/usr/include/php/ext/date/lib -DHAVE_CONFIG_H -g -O2 -c /home/jeff/software/builds/xcache-3.0.3/xcache/xc_ini.c -o xcache/xc_ini.lo libtool: compile: cc -I. -I/home/jeff/software/builds/xcache-3.0.3 -DPHP_ATOM_INC -I/home/jeff/software/builds/xcache-3.0.3/include -I/home/jeff/software/builds/xcache-3.0.3/main -I/home/jeff/software/builds/xcache-3.0.3 -I/usr/include/php -I/usr/include/php/main -I/usr/include/php/TSRM -I/usr/include/php/Zend -I/usr/include/php/ext -I/usr/include/php/ext/date/lib -DHAVE_CONFIG_H -g -O2 -c /home/jeff/software/builds/xcache-3.0.3/xcache/xc_ini.c -fPIC -DPIC -o xcache/.libs/xc_ini.o /bin/sh /home/jeff/software/builds/xcache-3.0.3/libtool --mode=compile cc -I. -I/home/jeff/software/builds/xcache-3.0.3 -DPHP_ATOM_INC -I/home/jeff/software/builds/xcache-3.0.3/include -I/home/jeff/software/builds/xcache-3.0.3/main -I/home/jeff/software/builds/xcache-3.0.3 -I/usr/include/php -I/usr/include/php/main -I/usr/include/php/TSRM -I/usr/include/php/Zend -I/usr/include/php/ext -I/usr/include/php/ext/date/lib -DHAVE_CONFIG_H -g -O2 -c /home/jeff/software/builds/xcache-3.0.3/xcache/xc_lock.c -o xcache/xc_lock.lo libtool: compile: cc -I. -I/home/jeff/software/builds/xcache-3.0.3 -DPHP_ATOM_INC -I/home/jeff/software/builds/xcache-3.0.3/include -I/home/jeff/software/builds/xcache-3.0.3/main -I/home/jeff/software/builds/xcache-3.0.3 -I/usr/include/php -I/usr/include/php/main -I/usr/include/php/TSRM -I/usr/include/php/Zend -I/usr/include/php/ext -I/usr/include/php/ext/date/lib -DHAVE_CONFIG_H -g -O2 -c /home/jeff/software/builds/xcache-3.0.3/xcache/xc_lock.c -fPIC -DPIC -o xcache/.libs/xc_lock.o /bin/sh /home/jeff/software/builds/xcache-3.0.3/libtool --mode=compile cc -I. -I/home/jeff/software/builds/xcache-3.0.3 -DPHP_ATOM_INC -I/home/jeff/software/builds/xcache-3.0.3/include -I/home/jeff/software/builds/xcache-3.0.3/main -I/home/jeff/software/builds/xcache-3.0.3 -I/usr/include/php -I/usr/include/php/main -I/usr/include/php/TSRM -I/usr/include/php/Zend -I/usr/include/php/ext -I/usr/include/php/ext/date/lib -DHAVE_CONFIG_H -g -O2 -c /home/jeff/software/builds/xcache-3.0.3/xcache/xc_opcode_spec.c -o xcache/xc_opcode_spec.lo libtool: compile: cc -I. -I/home/jeff/software/builds/xcache-3.0.3 -DPHP_ATOM_INC -I/home/jeff/software/builds/xcache-3.0.3/include -I/home/jeff/software/builds/xcache-3.0.3/main -I/home/jeff/software/builds/xcache-3.0.3 -I/usr/include/php -I/usr/include/php/main -I/usr/include/php/TSRM -I/usr/include/php/Zend -I/usr/include/php/ext -I/usr/include/php/ext/date/lib -DHAVE_CONFIG_H -g -O2 -c /home/jeff/software/builds/xcache-3.0.3/xcache/xc_opcode_spec.c -fPIC -DPIC -o xcache/.libs/xc_opcode_spec.o /usr/bin/m4 -B 102400 -D srcdir=''"/home/jeff/software/builds/xcache-3.0.3'" -D builddir=''".'" /home/jeff/software/builds/xcache-3.0.3/processor/main.m4 > ./processor.out.c.tmp /usr/bin/m4: warning: `m4 -B' may be removed in a future release AUTOCHECK INFO: runtime autocheck Disabled (optimized build) AUTOCHECK INFO: zend_compiled_variable: processor looks good AUTOCHECK ERROR: ==== calc zend_try_catch_element ================= AUTOCHECK expected: "try_op","catch_op","finally_op","finally_end" AUTOCHECK missing : "finally_op" "finally_end" AUTOCHECK INFO: zend_brk_cont_element: processor looks good AUTOCHECK INFO: HashTable?: processor looks good AUTOCHECK INFO: zval: processor looks good AUTOCHECK INFO: zend_arg_info: processor looks good AUTOCHECK INFO: zend_constant: processor looks good AUTOCHECK INFO: zend_property_info: processor looks good AUTOCHECK INFO: zend_trait_method_reference: processor looks good AUTOCHECK INFO: zend_trait_alias: processor looks good AUTOCHECK INFO: zend_trait_precedence: processor looks good AUTOCHECK INFO: zend_class_entry: processor looks good AUTOCHECK INFO: znode: processor looks good AUTOCHECK INFO: zend_op: processor looks good AUTOCHECK INFO: zend_literal: processor looks good AUTOCHECK ERROR: ==== calc zend_op_array ================= AUTOCHECK expected: "type","function_name","scope","fn_flags","prototype","num_args","required_num_args","arg_info","refcount","opcodes","last","vars","last_var","T","nested_calls","used_stack","brk_cont_array","last_brk_cont","try_catch_array","last_try_catch","has_finally_block","static_variables","this_var","filename","line_start","line_end","doc_comment","doc_comment_len","early_binding","literals","last_literal","run_time_cache","last_cache_slot","reserved" AUTOCHECK missing : "nested_calls" "used_stack" "has_finally_block" AUTOCHECK INFO: xc_constinfo_t: processor looks good AUTOCHECK INFO: xc_op_array_info_detail_t: processor looks good AUTOCHECK INFO: xc_op_array_info_t: processor looks good AUTOCHECK INFO: xc_funcinfo_t: processor looks good AUTOCHECK INFO: xc_classinfo_t: processor looks good AUTOCHECK INFO: xc_autoglobal_t: processor looks good AUTOCHECK INFO: xc_compilererror_t: processor looks good AUTOCHECK INFO: xc_entry_data_php_t: processor looks good AUTOCHECK INFO: xc_entry_t: processor looks good AUTOCHECK INFO: xc_entry_php_t: processor looks good AUTOCHECK INFO: xc_entry_var_t: processor looks good AUTOCHECK ERROR: ==== store zend_try_catch_element ================= AUTOCHECK ERROR: ==== store zend_op_array ================= AUTOCHECK ERROR: ==== restore zend_try_catch_element ================= AUTOCHECK ERROR: ==== restore zend_op_array ================= AUTOCHECK ERROR: ==== dprint zend_try_catch_element ================= AUTOCHECK ERROR: ==== dprint zend_op_array ================= AUTOCHECK ERROR: ==== dasm zend_try_catch_element ================= AUTOCHECK ERROR: ==== dasm zend_op_array ================= AUTOCHECK ERROR: ==== asm zend_try_catch_element ================= AUTOCHECK ERROR: ==== asm zend_op_array ================= make: * [processor.out.c] Error 1

1 2 3 4 5 6 7 8 9 10 11 12 13 14 15 16 17 18
Note: See TracQuery for help on using queries.